Information card for entry 7220816
Formula | C2.57 H7 Cd2 N4 O7.43 S |
Calculated formula | C2.57 H7 Cd2 N4 O7.43 S |
Title of publication | Zinc and cadmium metal-directed coordination polymers: in situ flexible tetrazole ligand synthesis, structures, and properties |
Authors of publication | Dong, Ruo Ting; Ma, Zhao Ying; Chen, Li Xin; Huang, Lan Fen; Li, Qian Hong; Hu, Ming Yuan; Shen, Mo Yuan; Li, Chu Wen; Deng, Hong |
Journal of publication | CrystEngComm |
Year of publication | 2015 |
Journal volume | 17 |
Journal issue | 30 |
Pages of publication | 5814 |
a | 17.501 ± 0.003 Å |
b | 33.436 ± 0.006 Å |
c | 7.1042 ± 0.0012 Å |
α | 90° |
β | 90° |
γ | 90° |
Cell volume | 4157.1 ± 1.2 Å3 |
Cell temperature | 296 ± 2 K |
Ambient diffraction temperature | 296 ± 2 K |
Number of distinct elements | 6 |
Space group number | 43 |
Hermann-Mauguin space group symbol | F d d 2 |
Hall space group symbol | F 2 -2d |
Residual factor for all reflections | 0.0262 |
Residual factor for significantly intense reflections | 0.0239 |
Weighted residual factors for significantly intense reflections | 0.0554 |
Weighted residual factors for all reflections included in the refinement | 0.0572 |
Goodness-of-fit parameter for all reflections included in the refinement | 1.058 |
Diffraction radiation wavelength | 0.71073 Å |
Diffraction radiation type | MoKα |