Information card for entry 7220825
Formula | C4 H10 Cl2 Fe N8 O3 |
Calculated formula | C4 H10 Cl2 Fe N8 O3 |
Title of publication | A series of multi-dimensional metal‒organic frameworks with trans-4,4′-azo-1,2,4-triazole: polymorphism, guest induced single-crystal-to-single-crystal transformation and solvatochromism |
Authors of publication | Ding, Bin; Wang, You You; Liu, Shi Xin; Wu, Xiang Xia; Zhu, Zhao Zhou; Huo, Jian Zhong; Liu, Yuan Yuan |
Journal of publication | CrystEngComm |
Year of publication | 2015 |
Journal volume | 17 |
Journal issue | 29 |
Pages of publication | 5396 |
a | 8.0475 ± 0.0005 Å |
b | 11.7191 ± 0.0007 Å |
c | 12.4796 ± 0.0008 Å |
α | 90° |
β | 93.93 ± 0.001° |
γ | 90° |
Cell volume | 1174.18 ± 0.13 Å3 |
Cell temperature | 173 ± 2 K |
Ambient diffraction temperature | 173 ± 2 K |
Number of distinct elements | 6 |
Space group number | 14 |
Hermann-Mauguin space group symbol | P 1 21/c 1 |
Hall space group symbol | -P 2ybc |
Residual factor for all reflections | 0.0233 |
Residual factor for significantly intense reflections | 0.0211 |
Weighted residual factors for significantly intense reflections | 0.0473 |
Weighted residual factors for all reflections included in the refinement | 0.0485 |
Goodness-of-fit parameter for all reflections included in the refinement | 1.083 |
Diffraction radiation wavelength | 0.71073 Å |
Diffraction radiation type | MoKα |