Information card for entry 7220827
Formula | C6 H8 Fe N10 O2 S2 |
Calculated formula | C6 H8 Fe N10 O2 S2 |
Title of publication | A series of multi-dimensional metal‒organic frameworks with trans-4,4′-azo-1,2,4-triazole: polymorphism, guest induced single-crystal-to-single-crystal transformation and solvatochromism |
Authors of publication | Ding, Bin; Wang, You You; Liu, Shi Xin; Wu, Xiang Xia; Zhu, Zhao Zhou; Huo, Jian Zhong; Liu, Yuan Yuan |
Journal of publication | CrystEngComm |
Year of publication | 2015 |
Journal volume | 17 |
Journal issue | 29 |
Pages of publication | 5396 |
a | 22.145 ± 0.007 Å |
b | 5.6942 ± 0.0018 Å |
c | 11.621 ± 0.004 Å |
α | 90° |
β | 98.19 ± 0.006° |
γ | 90° |
Cell volume | 1450.4 ± 0.8 Å3 |
Cell temperature | 173 ± 2 K |
Ambient diffraction temperature | 173 ± 2 K |
Number of distinct elements | 6 |
Space group number | 15 |
Hermann-Mauguin space group symbol | C 1 2/c 1 |
Hall space group symbol | -C 2yc |
Residual factor for all reflections | 0.0313 |
Residual factor for significantly intense reflections | 0.0292 |
Weighted residual factors for significantly intense reflections | 0.0734 |
Weighted residual factors for all reflections included in the refinement | 0.0747 |
Goodness-of-fit parameter for all reflections included in the refinement | 1.005 |
Diffraction radiation wavelength | 0.71073 Å |
Diffraction radiation type | MoKα |