Information card for entry 7220829
Formula | C6 H4 N10 S2 Zn |
Calculated formula | C6 H4 N10 S2 Zn |
Title of publication | A series of multi-dimensional metal‒organic frameworks with trans-4,4′-azo-1,2,4-triazole: polymorphism, guest induced single-crystal-to-single-crystal transformation and solvatochromism |
Authors of publication | Ding, Bin; Wang, You You; Liu, Shi Xin; Wu, Xiang Xia; Zhu, Zhao Zhou; Huo, Jian Zhong; Liu, Yuan Yuan |
Journal of publication | CrystEngComm |
Year of publication | 2015 |
Journal volume | 17 |
Journal issue | 29 |
Pages of publication | 5396 |
a | 12.2481 ± 0.0013 Å |
b | 5.6785 ± 0.0006 Å |
c | 17.9506 ± 0.0018 Å |
α | 90° |
β | 106.572 ± 0.002° |
γ | 90° |
Cell volume | 1196.6 ± 0.2 Å3 |
Cell temperature | 173 ± 2 K |
Ambient diffraction temperature | 173 ± 2 K |
Number of distinct elements | 5 |
Space group number | 15 |
Hermann-Mauguin space group symbol | C 1 2/c 1 |
Hall space group symbol | -C 2yc |
Residual factor for all reflections | 0.0208 |
Residual factor for significantly intense reflections | 0.0201 |
Weighted residual factors for significantly intense reflections | 0.0503 |
Weighted residual factors for all reflections included in the refinement | 0.0511 |
Goodness-of-fit parameter for all reflections included in the refinement | 1.04 |
Diffraction radiation wavelength | 0.71073 Å |
Diffraction radiation type | MoKα |