Information card for entry 7220841
Common name | (Z)-((4-(N,N-dimethyl)phenyl)(2-methoxycarbonylvinyl)telluride |
Chemical name | (Z)-Methyl 2-(4'-(N,N-dimethyl)phenyltelluro)acrylate |
Formula | C12 H15 N O2 Te |
Calculated formula | C12 H15 N O2 Te |
SMILES | [Te](c1ccc(N(C)C)cc1)/C=C\C(=O)OC |
Title of publication | Hydrotelluration of acetylenic Esters: Structural Characterization of Stereoisomers of Methyl/ethyl (β-aryltelluro)acrylates |
Authors of publication | Chauhan, Ashok Kumar Singh; Singh, Bandana; Srivastava, Ramesh Chandra; Duthie, Andrew; Butcher, Ray Jay |
Journal of publication | RSC Adv. |
Year of publication | 2015 |
a | 7.969 ± 0.005 Å |
b | 5.535 ± 0.005 Å |
c | 14.965 ± 0.005 Å |
α | 90° |
β | 103.239 ± 0.005° |
γ | 90° |
Cell volume | 642.5 ± 0.7 Å3 |
Cell temperature | 100 ± 2 K |
Ambient diffraction temperature | 100 ± 2 K |
Number of distinct elements | 5 |
Space group number | 7 |
Hermann-Mauguin space group symbol | P 1 n 1 |
Hall space group symbol | P -2yac |
Residual factor for all reflections | 0.0397 |
Residual factor for significantly intense reflections | 0.0317 |
Weighted residual factors for significantly intense reflections | 0.0557 |
Weighted residual factors for all reflections included in the refinement | 0.0607 |
Goodness-of-fit parameter for all reflections included in the refinement | 0.992 |
Diffraction radiation wavelength | 0.71073 Å |
Diffraction radiation type | MoKα |