Information card for entry 7220844
Chemical name | (Z)-((2,4,6-trimethylphenyl)(2-phenylvinyl)telluride |
Formula | C17 H18 Te |
Calculated formula | C17 H18 Te |
SMILES | [Te](c1c(cc(cc1C)C)C)/C=C\c1ccccc1 |
Title of publication | Hydrotelluration of acetylenic Esters: Structural Characterization of Stereoisomers of Methyl/ethyl (β-aryltelluro)acrylates |
Authors of publication | Chauhan, Ashok Kumar Singh; Singh, Bandana; Srivastava, Ramesh Chandra; Duthie, Andrew; Butcher, Ray Jay |
Journal of publication | RSC Adv. |
Year of publication | 2015 |
a | 17.9956 ± 0.0006 Å |
b | 10.948 ± 0.0003 Å |
c | 15.7185 ± 0.0005 Å |
α | 90° |
β | 109.94 ± 0.003° |
γ | 90° |
Cell volume | 2911.14 ± 0.17 Å3 |
Cell temperature | 120 ± 2 K |
Ambient diffraction temperature | 120 ± 2 K |
Number of distinct elements | 3 |
Space group number | 15 |
Hermann-Mauguin space group symbol | C 1 2/c 1 |
Hall space group symbol | -C 2yc |
Residual factor for all reflections | 0.0356 |
Residual factor for significantly intense reflections | 0.0329 |
Weighted residual factors for significantly intense reflections | 0.0844 |
Weighted residual factors for all reflections included in the refinement | 0.0866 |
Goodness-of-fit parameter for all reflections included in the refinement | 1.077 |
Diffraction radiation wavelength | 1.54184 Å |
Diffraction radiation type | CuKα |