Information card for entry 7220869
Chemical name | (1E)-1,2-bis[3-(Bromomethyl)phenyl]-diazene |
Formula | C14 H12 Br2 N2 |
Calculated formula | C14 H12 Br2 N2 |
Title of publication | Thermodynamic parameters of the pedal motion in the crystal structures of two bromomethylated azobenzenes |
Authors of publication | Vande Velde, Christophe M. L.; Zeller, Matthias; Azov, Vladimir A. |
Journal of publication | CrystEngComm |
Year of publication | 2015 |
Journal volume | 17 |
Journal issue | 30 |
Pages of publication | 5751 |
a | 14.051 ± 0.002 Å |
b | 4.4406 ± 0.0006 Å |
c | 11.2041 ± 0.0016 Å |
α | 90° |
β | 99.129 ± 0.002° |
γ | 90° |
Cell volume | 690.22 ± 0.17 Å3 |
Cell temperature | 270 ± 2 K |
Ambient diffraction temperature | 270 ± 2 K |
Number of distinct elements | 4 |
Space group number | 14 |
Hermann-Mauguin space group symbol | P 1 21/c 1 |
Hall space group symbol | -P 2ybc |
Residual factor for all reflections | 0.054 |
Residual factor for significantly intense reflections | 0.0312 |
Weighted residual factors for significantly intense reflections | 0.0722 |
Weighted residual factors for all reflections included in the refinement | 0.0797 |
Goodness-of-fit parameter for all reflections included in the refinement | 1.023 |
Diffraction radiation wavelength | 0.71073 Å |
Diffraction radiation type | MoKα |