Information card for entry 7220881
Formula | C108 H106 Cu2 N24 O102 P2 W24 |
Calculated formula | C108 H72 Cu2 N24 O95 P2 W24 |
Title of publication | Polyoxometalate-directed assembly and various structures of inorganic‒organic hybrid compounds based on a semi-rigid bis-pyridyl-bis-amide |
Authors of publication | Wang, Xiu-Li; Xu, Na; Zhao, Xun-Zhang; Zhang, Ju-Wen; Gong, Chun-Hua; Li, Tian-Jiao |
Journal of publication | CrystEngComm |
Year of publication | 2015 |
Journal volume | 17 |
Journal issue | 37 |
Pages of publication | 7038 |
a | 15.4 ± 0.0006 Å |
b | 17.393 ± 0.0007 Å |
c | 17.586 ± 0.0007 Å |
α | 99.683 ± 0.001° |
β | 101.239 ± 0.001° |
γ | 106.964 ± 0.001° |
Cell volume | 4290 ± 0.3 Å3 |
Cell temperature | 293 ± 2 K |
Ambient diffraction temperature | 293 ± 2 K |
Number of distinct elements | 7 |
Space group number | 2 |
Hermann-Mauguin space group symbol | P -1 |
Hall space group symbol | -P 1 |
Residual factor for all reflections | 0.1017 |
Residual factor for significantly intense reflections | 0.0912 |
Weighted residual factors for significantly intense reflections | 0.2039 |
Weighted residual factors for all reflections included in the refinement | 0.2081 |
Goodness-of-fit parameter for all reflections included in the refinement | 1.197 |
Diffraction radiation wavelength | 0.71069 Å |
Diffraction radiation type | MoKα |