Information card for entry 7220915
Chemical name | 5 |
Formula | C84 H58 Co3 N12 O8 |
Calculated formula | C84 H58 Co3 N12 O8 |
Title of publication | Discrete and polymeric complexes of a macrocyclic pillar ligand in the absence and presence of dicarboxylic acid coligands |
Authors of publication | Ryu, Hyunsoo; Mulyana, Yanyan; Park, In-Hyeok; Kim, Jinhee; Lindoy, Leonard F.; Lee, Shim Sung |
Journal of publication | CrystEngComm |
Year of publication | 2015 |
Journal volume | 17 |
Journal issue | 30 |
Pages of publication | 5717 |
a | 19.8884 ± 0.0013 Å |
b | 33.434 ± 0.002 Å |
c | 26.1619 ± 0.0017 Å |
α | 90° |
β | 105.04 ± 0.002° |
γ | 90° |
Cell volume | 16800.4 ± 1.9 Å3 |
Cell temperature | 173 ± 2 K |
Ambient diffraction temperature | 173 ± 2 K |
Number of distinct elements | 5 |
Space group number | 15 |
Hermann-Mauguin space group symbol | C 1 2/c 1 |
Hall space group symbol | -C 2yc |
Residual factor for all reflections | 0.1209 |
Residual factor for significantly intense reflections | 0.0714 |
Weighted residual factors for significantly intense reflections | 0.2094 |
Weighted residual factors for all reflections included in the refinement | 0.2292 |
Goodness-of-fit parameter for all reflections included in the refinement | 1.043 |
Diffraction radiation wavelength | 0.71073 Å |
Diffraction radiation type | MoKα |