Information card for entry 7220932
Formula | C11 H8 Cu0.5 N5 O3 |
Calculated formula | C11 H8 Cu0.5 N5 O3 |
Title of publication | Synthesis, X-ray characterization and DFT studies of N-benzimidazolyl-pyrimidine‒M(ii) complexes (M = Cu, Co and Ni): the prominent role of π-hole and anion‒π interactions |
Authors of publication | Cañellas, Santiago; Bauzá, Antonio; Lancho, Aïda; García-Raso, Angel; Fiol, Joan J.; Molins, Elies; Ballester, Pablo; Frontera, Antonio |
Journal of publication | CrystEngComm |
Year of publication | 2015 |
Journal volume | 17 |
Journal issue | 31 |
Pages of publication | 5987 |
a | 15.354 ± 0.004 Å |
b | 9.78 ± 0.002 Å |
c | 16.2709 ± 0.0014 Å |
α | 90° |
β | 104.57 ± 0.04° |
γ | 90° |
Cell volume | 2364.7 ± 0.9 Å3 |
Cell temperature | 293 ± 2 K |
Ambient diffraction temperature | 293 ± 2 K |
Number of distinct elements | 5 |
Space group number | 15 |
Hermann-Mauguin space group symbol | C 1 2/c 1 |
Hall space group symbol | -C 2yc |
Residual factor for all reflections | 0.0728 |
Residual factor for significantly intense reflections | 0.0389 |
Weighted residual factors for significantly intense reflections | 0.0832 |
Weighted residual factors for all reflections included in the refinement | 0.098 |
Goodness-of-fit parameter for all reflections included in the refinement | 1.079 |
Diffraction radiation probe | x-ray |
Diffraction radiation wavelength | 0.71073 Å |
Diffraction radiation type | MoKα |