Information card for entry 7220934
Formula | C22 H16 N10 Ni O6 |
Calculated formula | C22 H16 N10 Ni O6 |
SMILES | N1(=[O][Ni]2(O1)([n]1cn(c3c1cccc3)c1ncccn1)([n]1cn(c3c1cccc3)c1ncccn1)[O]=[N](O2)=O)=O |
Title of publication | Synthesis, X-ray characterization and DFT studies of N-benzimidazolyl-pyrimidine‒M(ii) complexes (M = Cu, Co and Ni): the prominent role of π-hole and anion‒π interactions |
Authors of publication | Cañellas, Santiago; Bauzá, Antonio; Lancho, Aïda; García-Raso, Angel; Fiol, Joan J.; Molins, Elies; Ballester, Pablo; Frontera, Antonio |
Journal of publication | CrystEngComm |
Year of publication | 2015 |
Journal volume | 17 |
Journal issue | 31 |
Pages of publication | 5987 |
a | 15.327 ± 0.008 Å |
b | 9.623 ± 0.006 Å |
c | 16.459 ± 0.008 Å |
α | 90° |
β | 104.47 ± 0.04° |
γ | 90° |
Cell volume | 2351 ± 2 Å3 |
Cell temperature | 293 ± 2 K |
Ambient diffraction temperature | 293 ± 2 K |
Number of distinct elements | 5 |
Space group number | 15 |
Hermann-Mauguin space group symbol | C 1 2/c 1 |
Hall space group symbol | -C 2yc |
Residual factor for all reflections | 0.2903 |
Residual factor for significantly intense reflections | 0.0925 |
Weighted residual factors for significantly intense reflections | 0.0895 |
Weighted residual factors for all reflections included in the refinement | 0.1299 |
Goodness-of-fit parameter for all reflections included in the refinement | 0.841 |
Diffraction radiation probe | x-ray |
Diffraction radiation wavelength | 0.71073 Å |
Diffraction radiation type | MoKα |