Information card for entry 7220968
Formula | C15 H11 Br0 Cd N O7 |
Calculated formula | C15 H11 Cd N O7 |
Title of publication | Construction of a series of metal‒organic frameworks based on novel flexible ligand 4-carboxy-1-(3,5-dicarboxy-benzyl)-pyridinium chloride and selective d-block metal ions: crystal structures and photoluminescence |
Authors of publication | Li, Hai-Yang; Cao, Li-Hui; Wei, Yong-Li; Xu, Hong; Zang, Shuang-Quan |
Journal of publication | CrystEngComm |
Year of publication | 2015 |
Journal volume | 17 |
Journal issue | 33 |
Pages of publication | 6297 |
a | 17.0363 ± 0.0004 Å |
b | 7.7794 ± 0.0002 Å |
c | 20.1494 ± 0.0005 Å |
α | 90° |
β | 90° |
γ | 90° |
Cell volume | 2670.44 ± 0.11 Å3 |
Cell temperature | 293 ± 2 K |
Ambient diffraction temperature | 293 ± 2 K |
Number of distinct elements | 6 |
Space group number | 61 |
Hermann-Mauguin space group symbol | P b c a |
Hall space group symbol | -P 2ac 2ab |
Residual factor for all reflections | 0.0407 |
Residual factor for significantly intense reflections | 0.0304 |
Weighted residual factors for significantly intense reflections | 0.0683 |
Weighted residual factors for all reflections included in the refinement | 0.072 |
Goodness-of-fit parameter for all reflections included in the refinement | 1.089 |
Diffraction radiation wavelength | 0.71073 Å |
Diffraction radiation type | MoKα |