Information card for entry 7221053
Formula | C H Cd Cl K N O |
Calculated formula | C3.87097 H2.32258 Cd0.387097 Cl0.0645161 K0.0645161 N3.09677 O0.774194 |
Title of publication | Ion template effects of 4,5-dicyanoimidazole in the assembly of a series of 3D bimetallic coordination networks |
Authors of publication | Zheng, Bao-Hua; Hao, Xue-Na; An, Bo; Qiao, Jin-Zhong; Hu, Tuo-Ping |
Journal of publication | CrystEngComm |
Year of publication | 2015 |
Journal volume | 17 |
Journal issue | 32 |
Pages of publication | 6103 |
a | 20.496 ± 0.007 Å |
b | 20.496 ± 0.007 Å |
c | 20.496 ± 0.007 Å |
α | 90° |
β | 90° |
γ | 90° |
Cell volume | 8610 ± 5 Å3 |
Cell temperature | 296 ± 2 K |
Ambient diffraction temperature | 296.15 K |
Number of distinct elements | 7 |
Space group number | 205 |
Hermann-Mauguin space group symbol | P a -3 |
Hall space group symbol | -P 2ac 2ab 3 |
Residual factor for all reflections | 0.0599 |
Residual factor for significantly intense reflections | 0.0379 |
Weighted residual factors for significantly intense reflections | 0.0859 |
Weighted residual factors for all reflections included in the refinement | 0.0948 |
Goodness-of-fit parameter for all reflections included in the refinement | 0.961 |
Diffraction radiation wavelength | 0.71073 Å |
Diffraction radiation type | MoKα |