Information card for entry 7221119
Formula |
Ga3 Pt2 |
Calculated formula |
Ga3 Pt2 |
Title of publication |
Kristallchemie des In und Ga in Legierungen mit einigen Uebergangselementen (Ni, Pd, Pt, Cu, Ag und Au) |
Authors of publication |
Hellner, E.; Laves, F. |
Journal of publication |
Zeitschrift fuer Naturforschung, Teil A. Physikalische Chemie, Kosmophysik (2,1947-32,1977) |
Year of publication |
1947 |
Journal volume |
2 |
Pages of publication |
177 - 183 |
a |
4.22 Å |
b |
4.22 Å |
c |
5.17 Å |
α |
90° |
β |
90° |
γ |
120° |
Cell volume |
79.734 Å3 |
Number of distinct elements |
2 |
Space group number |
164 |
Hermann-Mauguin space group symbol |
P -3 m 1 |
Hall space group symbol |
-P 3 2" |
Yes |
No |
No |