Information card for entry 7221121
Formula | C20 H17 Cl2 N5 O11 |
Calculated formula | C20 H17 Cl2 N5 O11 |
SMILES | c1cccc2[n+]1C(C(=O)N2)=C(c1c(=O)[nH]c2ccccn12)c1cccc[nH+]1.Cl(=O)(=O)(=O)[O-].Cl(=O)(=O)(=O)[O-].O |
Title of publication | Positional isomerism in triarylmethyl carbocation radical salts: positional isomeric effects, crystal structures and properties |
Authors of publication | Yong, Guo-Ping; Shen, Chen; Feng, Ya; Zhang, Xue-Rui; Zhao, Yu-Mei |
Journal of publication | CrystEngComm |
Year of publication | 2015 |
Journal volume | 17 |
Journal issue | 33 |
Pages of publication | 6338 |
a | 8.9344 ± 0.0002 Å |
b | 18.8814 ± 0.0006 Å |
c | 14.142 ± 0.0004 Å |
α | 90° |
β | 90.449 ± 0.002° |
γ | 90° |
Cell volume | 2385.6 ± 0.11 Å3 |
Cell temperature | 293 ± 2 K |
Ambient diffraction temperature | 293 ± 2 K |
Number of distinct elements | 5 |
Space group number | 14 |
Hermann-Mauguin space group symbol | P 1 21/c 1 |
Hall space group symbol | -P 2ybc |
Residual factor for all reflections | 0.1088 |
Residual factor for significantly intense reflections | 0.0711 |
Weighted residual factors for significantly intense reflections | 0.1794 |
Weighted residual factors for all reflections included in the refinement | 0.204 |
Goodness-of-fit parameter for all reflections included in the refinement | 1.066 |
Diffraction radiation wavelength | 0.71073 Å |
Diffraction radiation type | MoKα |