Information card for entry 7221152
Formula | C32.3 H29.45 N9.15 O10 Zn2 |
Calculated formula | C32.3 H29.45 N9.15 O10 Zn2 |
Title of publication | Pillared-bilayer zinc(ii)‒organic laminae: pore modification and selective gas adsorption |
Authors of publication | Lee, Li-Wei; Luo, Tzuoo-Tsair; Lo, Sheng-Han; Lee, Gene-Hsiang; Peng, Shie-Ming; Liu, Yen-Hsiang; Lee, Sheng-Long; Lu, Kuang-Lieh |
Journal of publication | CrystEngComm |
Year of publication | 2015 |
Journal volume | 17 |
Journal issue | 33 |
Pages of publication | 6320 |
a | 16.9909 ± 0.0015 Å |
b | 7.6688 ± 0.0007 Å |
c | 16.0077 ± 0.0015 Å |
α | 90° |
β | 102.322 ± 0.002° |
γ | 90° |
Cell volume | 2037.8 ± 0.3 Å3 |
Cell temperature | 150 ± 2 K |
Ambient diffraction temperature | 150 ± 2 K |
Number of distinct elements | 5 |
Space group number | 14 |
Hermann-Mauguin space group symbol | P 1 21/c 1 |
Hall space group symbol | -P 2ybc |
Residual factor for all reflections | 0.124 |
Residual factor for significantly intense reflections | 0.0851 |
Weighted residual factors for significantly intense reflections | 0.2369 |
Weighted residual factors for all reflections included in the refinement | 0.2651 |
Goodness-of-fit parameter for all reflections included in the refinement | 1.136 |
Diffraction radiation wavelength | 0.71073 Å |
Diffraction radiation type | MoKα |