Information card for entry 7221405
Chemical name |
Yb Co O3 |
Formula |
Co O3 Yb |
Calculated formula |
Co O3 Yb |
Title of publication |
Preparation and structural study from neutron diffraction data of R Co O3 (R = Pr, Tb, Dy, Ho, Er, Tm, Yb, Lu) perovskites |
Authors of publication |
Alonso, J.A.; Martinez-Lope, M.J.; de la Calle, C.; Pomjakushin, V. |
Journal of publication |
Journal of Materials Chemistry |
Year of publication |
2006 |
Journal volume |
16 |
Pages of publication |
1555 - 1560 |
a |
5.086 Å |
b |
5.4147 Å |
c |
7.3071 Å |
α |
90° |
β |
90° |
γ |
90° |
Cell volume |
201.231 Å3 |
Number of distinct elements |
3 |
Space group number |
62 |
Hermann-Mauguin space group symbol |
P b n m |
Hall space group symbol |
-P 2c 2ab |
Yes |
No |
No |