Information card for entry 7221411
Chemical name |
K Ni V F6 (H2 O) |
Formula |
F6 H2 K Ni O V |
Calculated formula |
F6 K Ni O V |
Title of publication |
Die Struktur einiger Fluoride, Oxide und Oxidfluoride A Me2 X6, der Rb Ni Cr F6 - Typ |
Authors of publication |
Babel, D.; Pausewang, G.; Viebahn, W. |
Journal of publication |
Zeitschrift fuer Naturforschung, Teil B. Anorganische Chemie, Organische Chemie (2,1947-32,1977) |
Year of publication |
1967 |
Journal volume |
22 |
Pages of publication |
1219 - 1220 |
a |
10.51 Å |
b |
10.51 Å |
c |
10.51 Å |
α |
90° |
β |
90° |
γ |
90° |
Cell volume |
1160.94 Å3 |
Number of distinct elements |
6 |
Space group number |
227 |
Hermann-Mauguin space group symbol |
F d -3 m :2 |
Hall space group symbol |
-F 4vw 2vw 3 |
Yes |
No |
No |