Information card for entry 7221437
Chemical name |
K Nb (W O6) (H2 O) |
Formula |
H2 K Nb O7 W |
Calculated formula |
K Nb O7 W |
Title of publication |
Die Struktur einiger Fluoride, Oxide und Oxidfluoride A Me2 X6, der Rb Ni Cr F6 - Typ |
Authors of publication |
Babel, D.; Viebahn, W.; Pausewang, G. |
Journal of publication |
Zeitschrift fuer Naturforschung, Teil B. Anorganische Chemie, Organische Chemie (2,1947-32,1977) |
Year of publication |
1967 |
Journal volume |
22 |
Pages of publication |
1219 - 1220 |
a |
10.49 Å |
b |
10.49 Å |
c |
10.49 Å |
α |
90° |
β |
90° |
γ |
90° |
Cell volume |
1154.32 Å3 |
Number of distinct elements |
5 |
Space group number |
227 |
Hermann-Mauguin space group symbol |
F d -3 m :2 |
Hall space group symbol |
-F 4vw 2vw 3 |
Yes |
No |
No |