Information card for entry 7221443
Chemical name |
Tl (Nb W O6) |
Formula |
Nb O6 Tl W |
Calculated formula |
Nb O6 Tl W |
Title of publication |
Die Struktur einiger Fluoride, Oxide und Oxidfluoride A Me2 X6, der RbNiCrF6-Typ |
Authors of publication |
Babel, D.; Viebahn, W.; Pausewang, G. |
Journal of publication |
Zeitschrift fuer Naturforschung, Teil B. Anorganische Chemie, Organische Chemie (2,1947-32,1977) |
Year of publication |
1967 |
Journal volume |
22 |
Pages of publication |
1219 - 1220 |
a |
10.36 Å |
b |
10.36 Å |
c |
10.36 Å |
α |
90° |
β |
90° |
γ |
90° |
Cell volume |
1111.94 Å3 |
Number of distinct elements |
4 |
Space group number |
227 |
Hermann-Mauguin space group symbol |
F d -3 m :2 |
Hall space group symbol |
-F 4vw 2vw 3 |
Yes |
No |
No |