Information card for entry 7221461
Chemical name |
Cs Nb2 O5 F |
Formula |
Cs F Nb2 O5 |
Calculated formula |
Cs F1.0002 Nb2 O4.9998 |
Title of publication |
Die Struktur einiger Fluoride, Oxide und Oxidfluoride A Me2 X6, der RbNiCrF6-Typ |
Authors of publication |
Babel, D.; Pausewang, G.; Viebahn, W. |
Journal of publication |
Zeitschrift fuer Naturforschung, Teil B. Anorganische Chemie, Organische Chemie (2,1947-32,1977) |
Year of publication |
1967 |
Journal volume |
22 |
Pages of publication |
1219 - 1220 |
a |
10.51 Å |
b |
10.51 Å |
c |
10.51 Å |
α |
90° |
β |
90° |
γ |
90° |
Cell volume |
1160.94 Å3 |
Number of distinct elements |
4 |
Space group number |
227 |
Hermann-Mauguin space group symbol |
F d -3 m :2 |
Hall space group symbol |
-F 4vw 2vw 3 |
Yes |
No |
No |