Information card for entry 7221477
Chemical name |
Sr Ga1.67 In0.33 |
Formula |
Ga1.67 In0.33 Sr |
Calculated formula |
Ga1.666 In0.334 Sr |
Title of publication |
Gemischte Erdalkalimetall-Trielide A(II) M1(III)(x) M2(III)(2-x) (A(II) = Ca, Sr, Ba; M(III) = Al, Ga, In): Strukturchemische und bindungstheoretische Untersuchungen |
Authors of publication |
Harms, W.; Wendorff, M.; Roehr, C. |
Journal of publication |
Zeitschrift fuer Naturforschung, Teil B. Anorganische Chemie, Organische Chemie (42,1987-) |
Year of publication |
2007 |
Journal volume |
62 |
Pages of publication |
177 - 194 |
a |
4.416 Å |
b |
4.416 Å |
c |
4.681 Å |
α |
90° |
β |
90° |
γ |
120° |
Cell volume |
79.055 Å3 |
Number of distinct elements |
3 |
Space group number |
191 |
Hermann-Mauguin space group symbol |
P 6/m m m |
Hall space group symbol |
-P 6 2 |
Yes |
No |
No |