Information card for entry 7221481
Chemical name |
La5 Zn0.5 Ti3.5 O15 |
Formula |
La5 O15 Ti3.5 Zn0.5 |
Calculated formula |
La5 O15 Ti3.5 Zn0.5 |
Title of publication |
Crstal structure, microwave dielectric properties and AC conductivity of B-cation hexagonal perovskites La5 M(x) Ti(4-x) O15 (x = 0.5, 1; M = Zn, Mg, Ga, Al) |
Authors of publication |
Kuang, X.; Allix, M.M.B.; Rosseinsky, M.J.; Niu, H.J.; Claridge, J.B.; Iddles, D.M.; Ibberson, R.M. |
Journal of publication |
Journal of Materials Chemistry |
Year of publication |
2006 |
Journal volume |
16 |
Pages of publication |
1038 - 1045 |
a |
5.567712 Å |
b |
5.567712 Å |
c |
22.01526 Å |
α |
90° |
β |
90° |
γ |
120° |
Cell volume |
591.028 Å3 |
Number of distinct elements |
4 |
Space group number |
165 |
Hermann-Mauguin space group symbol |
P -3 c 1 |
Hall space group symbol |
-P 3 2"c |
Yes |
No |
No |