Information card for entry 7221483
Chemical name |
La5 Ga Ti3 O15 |
Formula |
Ga La5 O15 Ti3 |
Calculated formula |
Ga1.006 La5 O15 Ti3 |
Title of publication |
Crstal structure, microwave dielectric properties and AC conductivity of B-cation hexagonal perovskites La5 M(x) Ti(4-x) O15 (x = 0.5, 1; M = Zn, Mg, Ga, Al) |
Authors of publication |
Kuang, X.; Niu, H.J.; Allix, M.M.B.; Claridge, J.B.; Rosseinsky, M.J.; Iddles, D.M.; Ibberson, R.M. |
Journal of publication |
Journal of Materials Chemistry |
Year of publication |
2006 |
Journal volume |
16 |
Pages of publication |
1038 - 1045 |
a |
5.545747 Å |
b |
5.545747 Å |
c |
21.95905 Å |
α |
90° |
β |
90° |
γ |
120° |
Cell volume |
584.877 Å3 |
Number of distinct elements |
4 |
Space group number |
165 |
Hermann-Mauguin space group symbol |
P -3 c 1 |
Hall space group symbol |
-P 3 2"c |
Yes |
No |
No |