Information card for entry 7221529
Formula | C46 H26 Cl2 N6 O12 U2 |
Calculated formula | C46 H26 Cl2 N6 O12 U2 |
Title of publication | Synthetic, structural, and luminescence study of uranyl coordination polymers containing chelating terpyridine and trispyridyltriazine ligands |
Authors of publication | Thangavelu, Sonia G.; Pope, Simon J. A.; Cahill, Christopher L. |
Journal of publication | CrystEngComm |
Year of publication | 2015 |
Journal volume | 17 |
Journal issue | 32 |
Pages of publication | 6236 |
a | 9.2926 ± 0.0003 Å |
b | 12.5893 ± 0.0005 Å |
c | 18.697 ± 0.0007 Å |
α | 90° |
β | 95.618 ± 0.001° |
γ | 90° |
Cell volume | 2176.81 ± 0.14 Å3 |
Cell temperature | 298 ± 2 K |
Ambient diffraction temperature | 298 ± 2 K |
Number of distinct elements | 6 |
Space group number | 14 |
Hermann-Mauguin space group symbol | P 1 21/n 1 |
Hall space group symbol | -P 2yn |
Residual factor for all reflections | 0.0297 |
Residual factor for significantly intense reflections | 0.0211 |
Weighted residual factors for significantly intense reflections | 0.0405 |
Weighted residual factors for all reflections included in the refinement | 0.0428 |
Goodness-of-fit parameter for all reflections included in the refinement | 1.083 |
Diffraction radiation wavelength | 0.71073 Å |
Diffraction radiation type | MoKα |