Information card for entry 7221536
Formula |
C43 H31 N5 |
Calculated formula |
C43 H31 N5 |
Title of publication |
Synthesis, structure, physical properties and OLED application of pyrazine‒triphenylamine fused conjugated compounds |
Authors of publication |
xu, liang; Zhao, Yongbiao; Long, Guankui; Wang, Yue; Zhao, Jun; Li, Dong-Sheng; Li, Junbo; Rakesh, Ganguly; Li, Yongxin; Sun, Handong; Sun, Xiaowei; Zhang, qichun |
Journal of publication |
RSC Adv. |
Year of publication |
2015 |
a |
11.6778 ± 0.0008 Å |
b |
12.0781 ± 0.0008 Å |
c |
13.0471 ± 0.0008 Å |
α |
93.976 ± 0.002° |
β |
114.75 ± 0.002° |
γ |
102.659 ± 0.002° |
Cell volume |
1603.4 ± 0.19 Å3 |
Cell temperature |
103 ± 2 K |
Ambient diffraction temperature |
103 ± 2 K |
Number of distinct elements |
3 |
Space group number |
2 |
Hermann-Mauguin space group symbol |
P -1 |
Hall space group symbol |
-P 1 |
Residual factor for all reflections |
0.1073 |
Residual factor for significantly intense reflections |
0.0606 |
Weighted residual factors for significantly intense reflections |
0.1376 |
Weighted residual factors for all reflections included in the refinement |
0.1626 |
Goodness-of-fit parameter for all reflections included in the refinement |
1.051 |
Diffraction radiation wavelength |
0.71073 Å |
Diffraction radiation type |
MoKα |
Yes |
Yes |
No |