Information card for entry 7221562
Formula | C2 H6 Na2 O14 P2 V2 |
Calculated formula | C2 H6 Na2 O14 P2 V2 |
Title of publication | Synthesis and electrochemical investigation of novel phosphite based layered cathodes for Li-ion batteries |
Authors of publication | Hameed, A. Shahul; Reddy, M. V.; Sarkar, Nirjhar; Chowdari, B. V. R.; Vittal, Jagadese J. |
Journal of publication | RSC Adv. |
Year of publication | 2015 |
Journal volume | 5 |
Journal issue | 74 |
Pages of publication | 60630 |
a | 6.3255 ± 0.0004 Å |
b | 6.776 ± 0.0005 Å |
c | 8.0759 ± 0.0006 Å |
α | 104.992 ± 0.001° |
β | 101.679 ± 0.001° |
γ | 99.12 ± 0.001° |
Cell volume | 319.2 ± 0.04 Å3 |
Cell temperature | 223 ± 2 K |
Ambient diffraction temperature | 223 ± 2 K |
Number of distinct elements | 6 |
Space group number | 2 |
Hermann-Mauguin space group symbol | P -1 |
Hall space group symbol | -P 1 |
Residual factor for all reflections | 0.0307 |
Residual factor for significantly intense reflections | 0.0288 |
Weighted residual factors for significantly intense reflections | 0.0734 |
Weighted residual factors for all reflections included in the refinement | 0.0745 |
Goodness-of-fit parameter for all reflections included in the refinement | 1.059 |
Diffraction radiation wavelength | 0.71073 Å |
Diffraction radiation type | MoKα |