Information card for entry 7221570
Formula | C25 H20 O |
Calculated formula | C25 H20 O |
SMILES | OC(c1ccccc1)(c1ccccc1)c1ccc(cc1)c1ccccc1 |
Title of publication | Aspects of crystal engineering arising from packing behavior of functional mono para-substituted trityl compounds |
Authors of publication | Knepper, Ingo; Seichter, Wilhelm; Skobridis, Konstantinos; Theodorou, Vassiliki; Weber, Edwin |
Journal of publication | CrystEngComm |
Year of publication | 2015 |
Journal volume | 17 |
Journal issue | 33 |
Pages of publication | 6355 |
a | 15.6058 ± 0.0003 Å |
b | 18.7804 ± 0.0004 Å |
c | 21.1189 ± 0.0004 Å |
α | 68.874 ± 0.001° |
β | 74.947 ± 0.001° |
γ | 74.08 ± 0.001° |
Cell volume | 5462.16 ± 0.19 Å3 |
Cell temperature | 100 ± 2 K |
Ambient diffraction temperature | 100 ± 2 K |
Number of distinct elements | 3 |
Space group number | 2 |
Hermann-Mauguin space group symbol | P -1 |
Hall space group symbol | -P 1 |
Residual factor for all reflections | 0.0873 |
Residual factor for significantly intense reflections | 0.0521 |
Weighted residual factors for significantly intense reflections | 0.1254 |
Weighted residual factors for all reflections included in the refinement | 0.1522 |
Goodness-of-fit parameter for all reflections included in the refinement | 1.005 |
Diffraction radiation wavelength | 0.71073 Å |
Diffraction radiation type | MoKα |