Information card for entry 7221573
Common name | 5-(3,5-bis(trifluoromethyl)phenyl)-2-formylpyrrole |
Chemical name | 5-(3,5-bis(trifluoromethyl)phenyl)-1H-pyrrole-2-carbaldehyde |
Formula | C13 H7 F6 N O |
Calculated formula | C13 H7 F6 N O |
SMILES | FC(F)(F)c1cc(c2[nH]c(cc2)C=O)cc(c1)C(F)(F)F |
Title of publication | Exploring the influence of steric hindrance and electronic nature of substituents in the supramolecular arrangements of 5-(substituted phenyl)-2-formylpyrroles |
Authors of publication | Figueira, Cláudia A.; Lopes, Patrícia S.; Gomes, Clara S. B.; Veiros, Luís F.; Gomes, Pedro T. |
Journal of publication | CrystEngComm |
Year of publication | 2015 |
Journal volume | 17 |
Journal issue | 33 |
Pages of publication | 6406 |
a | 13.086 ± 0.002 Å |
b | 4.7468 ± 0.0007 Å |
c | 19.887 ± 0.003 Å |
α | 90° |
β | 105.901 ± 0.009° |
γ | 90° |
Cell volume | 1188 ± 0.3 Å3 |
Cell temperature | 150 ± 2 K |
Ambient diffraction temperature | 150 ± 2 K |
Number of distinct elements | 5 |
Space group number | 14 |
Hermann-Mauguin space group symbol | P 1 21/c 1 |
Hall space group symbol | -P 2ybc |
Residual factor for all reflections | 0.0962 |
Residual factor for significantly intense reflections | 0.0446 |
Weighted residual factors for significantly intense reflections | 0.0863 |
Weighted residual factors for all reflections included in the refinement | 0.0972 |
Goodness-of-fit parameter for all reflections included in the refinement | 0.948 |
Diffraction radiation probe | x-ray |
Diffraction radiation wavelength | 0.71073 Å |
Diffraction radiation type | MoKα |