Information card for entry 7221578
Formula | C17 H21 Cd N5 O8 S |
Calculated formula | C17 H21 Cd N5 O8 S |
Title of publication | Crystal engineering of cadmium coordination polymers decorated with nitro-functionalized thiophene-2,5-dicarboxylate and structurally related bis(imidazole) ligands with varying flexibility |
Authors of publication | Xue, Li-Ping; Li, Zhao-Hao; Ma, Lu-Fang; Wang, Li-Ya |
Journal of publication | CrystEngComm |
Year of publication | 2015 |
Journal volume | 17 |
Journal issue | 33 |
Pages of publication | 6441 |
a | 10.331 ± 0.002 Å |
b | 13.446 ± 0.003 Å |
c | 16.673 ± 0.003 Å |
α | 90° |
β | 110.858 ± 0.009° |
γ | 90° |
Cell volume | 2164.3 ± 0.8 Å3 |
Cell temperature | 293 ± 2 K |
Ambient diffraction temperature | 293 ± 2 K |
Number of distinct elements | 6 |
Space group number | 14 |
Hermann-Mauguin space group symbol | P 1 21/c 1 |
Hall space group symbol | -P 2ybc |
Residual factor for all reflections | 0.057 |
Residual factor for significantly intense reflections | 0.0507 |
Weighted residual factors for significantly intense reflections | 0.1252 |
Weighted residual factors for all reflections included in the refinement | 0.1296 |
Goodness-of-fit parameter for all reflections included in the refinement | 1.07 |
Diffraction radiation wavelength | 0.71073 Å |
Diffraction radiation type | MoKα |