Information card for entry 7221590
Formula | C38 H24 N2 O8 Si Zn2 |
Calculated formula | C37.9992 H23.9992 N2 O8 Si Zn2 |
Title of publication | Synthesis of an exceptional water-stable two-fold interpenetrated Zn(ii)-paddlewheel metal‒organic framework |
Authors of publication | Wang, Jingjing; Zhang, Jun; Jin, Fengyan; Luo, Yanping; Wang, Shufen; Zhang, Zaiyong; Wu, Yong; Liu, Hongke; Lu, Jack Y.; Fang, Min |
Journal of publication | CrystEngComm |
Year of publication | 2015 |
Journal volume | 17 |
Journal issue | 31 |
Pages of publication | 5906 |
a | 13.916 ± 0.0012 Å |
b | 13.916 ± 0.0012 Å |
c | 21.142 ± 0.004 Å |
α | 90° |
β | 90° |
γ | 90° |
Cell volume | 4094.3 ± 0.9 Å3 |
Cell temperature | 100 ± 1 K |
Ambient diffraction temperature | 100 ± 1 K |
Number of distinct elements | 6 |
Space group number | 131 |
Hermann-Mauguin space group symbol | P 42/m m c |
Hall space group symbol | -P 4c 2 |
Residual factor for all reflections | 0.0695 |
Residual factor for significantly intense reflections | 0.0628 |
Weighted residual factors for significantly intense reflections | 0.1899 |
Weighted residual factors for all reflections included in the refinement | 0.1944 |
Goodness-of-fit parameter for all reflections included in the refinement | 1.054 |
Diffraction radiation wavelength | 0.71073 Å |
Diffraction radiation type | MoKα |