Information card for entry 7221615
Formula | C36 H26 Cd2 N4 O9 |
Calculated formula | C36 H26 Cd2 N4 O9 |
Title of publication | Assembly of a series of d10coordination polymers based on W-shaped 1,3-di(2′,4′-dicarboxyphenyl)benzene: from syntheses, structural diversity, luminescence, to photocatalytic properties |
Authors of publication | Zhang, Xiutang; Fan, Liming; Fan, Weiliu; Li, Bin; Zhao, Xian |
Journal of publication | CrystEngComm |
Year of publication | 2015 |
Journal volume | 17 |
Journal issue | 35 |
Pages of publication | 6681 |
a | 11.0644 ± 0.0005 Å |
b | 28.5964 ± 0.0013 Å |
c | 10.4332 ± 0.0005 Å |
α | 90° |
β | 96.5018 ± 0.0015° |
γ | 90° |
Cell volume | 3279.9 ± 0.3 Å3 |
Cell temperature | 296 ± 2 K |
Ambient diffraction temperature | 296 ± 2 K |
Number of distinct elements | 5 |
Space group number | 14 |
Hermann-Mauguin space group symbol | P 1 21/c 1 |
Hall space group symbol | -P 2ybc |
Residual factor for all reflections | 0.059 |
Residual factor for significantly intense reflections | 0.0462 |
Weighted residual factors for significantly intense reflections | 0.1148 |
Weighted residual factors for all reflections included in the refinement | 0.1236 |
Goodness-of-fit parameter for all reflections included in the refinement | 1 |
Diffraction radiation wavelength | 0.71073 Å |
Diffraction radiation type | MoKα |