Information card for entry 7221629
Formula | C10 H34 Cu N4 O11 V2 |
Calculated formula | C10 H24 Cu N4 O11 V2 |
Title of publication | Sequential single-crystal-to-single-crystal transformations promoted by gradual thermal dehydration in a porous metavanadate hybrid |
Authors of publication | Martín-Caballero, Jagoba; Wéry, Ana San José; Artetxe, Beñat; Reinoso, Santiago; Felices, Leire San; Vilas, José Luis; Gutiérrez-Zorrilla, Juan M. |
Journal of publication | CrystEngComm |
Year of publication | 2015 |
Journal volume | 17 |
Journal issue | 46 |
Pages of publication | 8915 |
a | 16.4455 ± 0.0003 Å |
b | 15.0098 ± 0.0005 Å |
c | 27.8995 ± 0.0007 Å |
α | 79.513 ± 0.002° |
β | 98.024 ± 0.002° |
γ | 105.156 ± 0.002° |
Cell volume | 6505.5 ± 0.3 Å3 |
Cell temperature | 100 ± 2 K |
Ambient diffraction temperature | 100 ± 2 K |
Number of distinct elements | 6 |
Space group number | 2 |
Hermann-Mauguin space group symbol | P -1 |
Hall space group symbol | -P 1 |
Residual factor for all reflections | 0.0656 |
Residual factor for significantly intense reflections | 0.0458 |
Weighted residual factors for significantly intense reflections | 0.1012 |
Weighted residual factors for all reflections included in the refinement | 0.1106 |
Goodness-of-fit parameter for all reflections included in the refinement | 1.038 |
Diffraction radiation probe | x-ray |
Diffraction radiation wavelength | 0.71073 Å |
Diffraction radiation type | MoKα |