Information card for entry 7221640
Formula | C82 H62 Dy2 N16 O29 S6 |
Calculated formula | C82 H62 Dy2 N16 O29 S6 |
Title of publication | Unique lanthanide frameworks with 63topology based on 1,5-naphthalenedisulfonate and 1H-imidazo[4,5-f][1,10]-phenanthroline: syntheses, crystal structure, photoluminescence, and white light emission |
Authors of publication | Ma, Dou; Huo, Rui; Li, Xia |
Journal of publication | CrystEngComm |
Year of publication | 2015 |
Journal volume | 17 |
Journal issue | 34 |
Pages of publication | 6575 |
a | 17.2852 ± 0.0019 Å |
b | 16.1853 ± 0.0017 Å |
c | 15.9746 ± 0.0017 Å |
α | 90° |
β | 103.335 ± 0.002° |
γ | 90° |
Cell volume | 4348.7 ± 0.8 Å3 |
Cell temperature | 296 ± 2 K |
Ambient diffraction temperature | 296 ± 2 K |
Number of distinct elements | 6 |
Space group number | 14 |
Hermann-Mauguin space group symbol | P 1 21/c 1 |
Hall space group symbol | -P 2ybc |
Residual factor for all reflections | 0.0574 |
Residual factor for significantly intense reflections | 0.0387 |
Weighted residual factors for significantly intense reflections | 0.0814 |
Weighted residual factors for all reflections included in the refinement | 0.0889 |
Goodness-of-fit parameter for all reflections included in the refinement | 1.089 |
Diffraction radiation wavelength | 0.71073 Å |
Diffraction radiation type | MoKα |