Information card for entry 7221683
Formula | C29 H38 N4 O17 |
Calculated formula | C29 H28 N4 O12 |
Title of publication | Supramolecular open-framework architectures based on dicarboxylate H-bond acceptors and polytopic cations with three/four N‒H+donor units |
Authors of publication | Mouchaham, Georges; Gualino, Marion; Roques, Nans; Duhayon, Carine; Brandès, Stéphane; Sutter, Jean-Pascal |
Journal of publication | CrystEngComm |
Year of publication | 2015 |
Journal volume | 17 |
Journal issue | 46 |
Pages of publication | 8906 |
a | 38.2977 ± 0.0005 Å |
b | 38.2977 ± 0.0005 Å |
c | 22.9827 ± 0.0004 Å |
α | 90° |
β | 90° |
γ | 90° |
Cell volume | 33709 ± 0.9 Å3 |
Cell temperature | 110 K |
Ambient diffraction temperature | 110 K |
Number of distinct elements | 4 |
Space group number | 88 |
Hermann-Mauguin space group symbol | I 41/a :2 |
Hall space group symbol | -I 4ad |
Residual factor for all reflections | 0.0803 |
Residual factor for significantly intense reflections | 0.0743 |
Weighted residual factors for all reflections | 0.0838 |
Weighted residual factors for significantly intense reflections | 0.0811 |
Weighted residual factors for all reflections included in the refinement | 0.0803 |
Goodness-of-fit parameter for all reflections included in the refinement | 1.0691 |
Diffraction radiation wavelength | 1.5418 Å |
Diffraction radiation type | CuKα |