Information card for entry 7221752
Formula | C15 H16 O3 |
Calculated formula | C15 H16 O3 |
SMILES | O(c1cc2c(cc1)cc(cc2)[C@H](C)C(=O)OC)C |
Title of publication | Multi odd‒even effects on cell parameters, melting points, and optical properties of chiral crystal solids based on S-naproxen |
Authors of publication | Tang, Gui-Mei; Wang, Jin-Hua; Zhao, Chao; Wang, Yong-Tao; Cui, Yue-Zhi; Cheng, Fei-Yue; Ng, Seik Weng |
Journal of publication | CrystEngComm |
Year of publication | 2015 |
Journal volume | 17 |
Journal issue | 38 |
Pages of publication | 7258 |
a | 5.8912 ± 0.0001 Å |
b | 7.9258 ± 0.0002 Å |
c | 28.6878 ± 0.0005 Å |
α | 90° |
β | 90° |
γ | 90° |
Cell volume | 1339.5 ± 0.05 Å3 |
Cell temperature | 298 ± 2 K |
Ambient diffraction temperature | 298 ± 2 K |
Number of distinct elements | 3 |
Space group number | 19 |
Hermann-Mauguin space group symbol | P 21 21 21 |
Hall space group symbol | P 2ac 2ab |
Residual factor for all reflections | 0.0589 |
Residual factor for significantly intense reflections | 0.041 |
Weighted residual factors for significantly intense reflections | 0.1358 |
Weighted residual factors for all reflections included in the refinement | 0.1536 |
Goodness-of-fit parameter for all reflections included in the refinement | 1.043 |
Diffraction radiation wavelength | 0.71073 Å |
Diffraction radiation type | MoKα |