Information card for entry 7221756
Formula | C19 H24 O3 |
Calculated formula | C19 H24 O3 |
SMILES | c1(cc2c(cc1)cc(cc2)[C@@H](C(=O)OCCCCC)C)OC |
Title of publication | Multi odd‒even effects on cell parameters, melting points, and optical properties of chiral crystal solids based on S-naproxen |
Authors of publication | Tang, Gui-Mei; Wang, Jin-Hua; Zhao, Chao; Wang, Yong-Tao; Cui, Yue-Zhi; Cheng, Fei-Yue; Ng, Seik Weng |
Journal of publication | CrystEngComm |
Year of publication | 2015 |
Journal volume | 17 |
Journal issue | 38 |
Pages of publication | 7258 |
a | 5.806 ± 0.004 Å |
b | 8.297 ± 0.006 Å |
c | 37.02 ± 0.02 Å |
α | 90° |
β | 90° |
γ | 90° |
Cell volume | 1783 ± 2 Å3 |
Cell temperature | 566 ± 2 K |
Ambient diffraction temperature | 566 ± 2 K |
Number of distinct elements | 3 |
Space group number | 19 |
Hermann-Mauguin space group symbol | P 21 21 21 |
Hall space group symbol | P 2ac 2ab |
Residual factor for all reflections | 0.1118 |
Residual factor for significantly intense reflections | 0.0694 |
Weighted residual factors for significantly intense reflections | 0.2 |
Weighted residual factors for all reflections included in the refinement | 0.2304 |
Goodness-of-fit parameter for all reflections included in the refinement | 1.03 |
Diffraction radiation wavelength | 0.71073 Å |
Diffraction radiation type | MoKα |