Information card for entry 7221804
Chemical name | Triaqua-tris(bis(trifluoromethylsulfonyl)imide-O,O')-gadolinium(iii) |
Formula | C6 H6 F18 Gd N3 O15 S6 |
Calculated formula | C6 H6 F18 Gd N3 O15 S6 |
SMILES | C(F)(F)(F)S1(=NS(=[O][Gd]23(O1)([OH2])([OH2])([OH2])([O]=S(C(F)(F)F)(N=S(O2)(=O)C(F)(F)F)=O)[O]=S(C(F)(F)F)(N=S(O3)(=O)C(F)(F)F)=O)(=O)C(F)(F)F)=O |
Title of publication | Crystal structures of hydrated rare-earth bis(trifluoromethylsulfonyl)imide salts |
Authors of publication | Vander Hoogerstraete, Tom; Brooks, Neil R.; Onghena, Bieke; Van Meervelt, Luc; Binnemans, Koen |
Journal of publication | CrystEngComm |
Year of publication | 2015 |
Journal volume | 17 |
Journal issue | 37 |
Pages of publication | 7142 |
a | 18.3973 ± 0.0002 Å |
b | 18.3973 ± 0.0002 Å |
c | 18.3973 ± 0.0002 Å |
α | 90° |
β | 90° |
γ | 90° |
Cell volume | 6226.76 ± 0.12 Å3 |
Cell temperature | 100 ± 2 K |
Ambient diffraction temperature | 100 ± 2 K |
Number of distinct elements | 7 |
Space group number | 198 |
Hermann-Mauguin space group symbol | P 21 3 |
Hall space group symbol | P 2ac 2ab 3 |
Residual factor for all reflections | 0.0202 |
Residual factor for significantly intense reflections | 0.0184 |
Weighted residual factors for significantly intense reflections | 0.0394 |
Weighted residual factors for all reflections included in the refinement | 0.0403 |
Goodness-of-fit parameter for all reflections included in the refinement | 1.06 |
Diffraction radiation wavelength | 0.71073 Å |
Diffraction radiation type | MoKα |