Information card for entry 7221807
Chemical name | pentaaqua-tris(bis(trifluoromethylsulfonyl)imide-O)-terbium(iii) |
Formula | C6 H10 F18 N3 O17 S6 Tb |
Calculated formula | C6 H10 F18 N3 O17 S6 Tb |
SMILES | [Tb]([OH2])([OH2])([OH2])([OH2])([OH2])(OS(=O)(C(F)(F)F)=NS(=O)(=O)C(F)(F)F)(OS(=O)(C(F)(F)F)=NS(=O)(=O)C(F)(F)F)OS(C(F)(F)F)(=O)=NS(=O)(=O)C(F)(F)F |
Title of publication | Crystal structures of hydrated rare-earth bis(trifluoromethylsulfonyl)imide salts |
Authors of publication | Vander Hoogerstraete, Tom; Brooks, Neil R.; Onghena, Bieke; Van Meervelt, Luc; Binnemans, Koen |
Journal of publication | CrystEngComm |
Year of publication | 2015 |
Journal volume | 17 |
Journal issue | 37 |
Pages of publication | 7142 |
a | 12.9085 ± 0.0003 Å |
b | 18.369 ± 0.0004 Å |
c | 12.9307 ± 0.0003 Å |
α | 90° |
β | 94.275 ± 0.002° |
γ | 90° |
Cell volume | 3057.55 ± 0.12 Å3 |
Cell temperature | 100 ± 2 K |
Ambient diffraction temperature | 100 ± 2 K |
Number of distinct elements | 7 |
Space group number | 14 |
Hermann-Mauguin space group symbol | P 1 21/n 1 |
Hall space group symbol | -P 2yn |
Residual factor for all reflections | 0.0246 |
Residual factor for significantly intense reflections | 0.02 |
Weighted residual factors for significantly intense reflections | 0.0436 |
Weighted residual factors for all reflections included in the refinement | 0.0454 |
Goodness-of-fit parameter for all reflections included in the refinement | 1.017 |
Diffraction radiation wavelength | 0.71073 Å |
Diffraction radiation type | MoKα |