Information card for entry 7221819
Chemical name | diaquadi(N-4-pyridylnicotinamide)cadmium(II)nitrate |
Formula | C22 H22 Cd N8 O10 |
Calculated formula | C22 H22 Cd N8 O10 |
Title of publication | Selective gelation of N-(4-pyridyl)nicotinamide by copper(ii) salts |
Authors of publication | Ghosh, Dipankar; LebedytÄ—, Ieva; Yufit, Dmitry S.; Damodaran, Krishna K.; Steed, Jonathan W. |
Journal of publication | CrystEngComm |
Year of publication | 2015 |
Journal volume | 17 |
Journal issue | 42 |
Pages of publication | 8130 |
a | 7.3668 ± 0.0005 Å |
b | 9.1365 ± 0.0006 Å |
c | 9.9565 ± 0.0006 Å |
α | 76.1428 ± 0.0018° |
β | 73.5323 ± 0.0018° |
γ | 83.61 ± 0.002° |
Cell volume | 623.27 ± 0.07 Å3 |
Cell temperature | 120 K |
Ambient diffraction temperature | 120 K |
Number of distinct elements | 5 |
Space group number | 2 |
Hermann-Mauguin space group symbol | P -1 |
Hall space group symbol | -P 1 |
Residual factor for all reflections | 0.0595 |
Residual factor for significantly intense reflections | 0.0592 |
Weighted residual factors for significantly intense reflections | 0.1492 |
Weighted residual factors for all reflections included in the refinement | 0.1497 |
Goodness-of-fit parameter for all reflections included in the refinement | 1.072 |
Diffraction radiation probe | x-ray |
Diffraction radiation wavelength | 0.71073 Å |
Diffraction radiation type | MoKα |