Information card for entry 7221847
Formula | C64.6 H58.4 Cu N10 O6.6 |
Calculated formula | C64.6 H57.8 Cu N10 O6.6 |
Title of publication | Supramolecular features in the engineering of 3d metal complexes with phenyl-substituted imidazoles as ligands: the case of copper(ii) |
Authors of publication | Kounavi, Konstantina A.; Kitos, Alexandros A.; Moushi, Eleni E.; Manos, Manolis J.; Papatriantafyllopoulou, Constantina; Tasiopoulos, Anastasios J.; Perlepes, Spyros P.; Nastopoulos, Vassilios |
Journal of publication | CrystEngComm |
Year of publication | 2015 |
Journal volume | 17 |
Journal issue | 39 |
Pages of publication | 7510 |
a | 11.183 ± 0.0003 Å |
b | 29.7328 ± 0.0007 Å |
c | 17.7124 ± 0.0005 Å |
α | 90° |
β | 98.941 ± 0.003° |
γ | 90° |
Cell volume | 5817.8 ± 0.3 Å3 |
Cell temperature | 100 ± 2 K |
Ambient diffraction temperature | 100 ± 2 K |
Number of distinct elements | 5 |
Space group number | 15 |
Hermann-Mauguin space group symbol | C 1 2/c 1 |
Hall space group symbol | -C 2yc |
Residual factor for all reflections | 0.0853 |
Residual factor for significantly intense reflections | 0.0667 |
Weighted residual factors for significantly intense reflections | 0.1961 |
Weighted residual factors for all reflections included in the refinement | 0.2058 |
Goodness-of-fit parameter for all reflections included in the refinement | 1.035 |
Diffraction radiation wavelength | 0.71073 Å |
Diffraction radiation type | MoKα |