Information card for entry 7221849
Formula | C66 H61 Cl2 Cu N9 O9 |
Calculated formula | C66 H59 Cl2 Cu N9 O9 |
Title of publication | Supramolecular features in the engineering of 3d metal complexes with phenyl-substituted imidazoles as ligands: the case of copper(ii) |
Authors of publication | Kounavi, Konstantina A.; Kitos, Alexandros A.; Moushi, Eleni E.; Manos, Manolis J.; Papatriantafyllopoulou, Constantina; Tasiopoulos, Anastasios J.; Perlepes, Spyros P.; Nastopoulos, Vassilios |
Journal of publication | CrystEngComm |
Year of publication | 2015 |
Journal volume | 17 |
Journal issue | 39 |
Pages of publication | 7510 |
a | 11.64037 ± 0.00019 Å |
b | 15.846 ± 0.0004 Å |
c | 17.0057 ± 0.0003 Å |
α | 70.7034 ± 0.0019° |
β | 86.7179 ± 0.0016° |
γ | 88.1588 ± 0.0016° |
Cell volume | 2955.39 ± 0.11 Å3 |
Cell temperature | 100 ± 2 K |
Ambient diffraction temperature | 100 ± 2 K |
Number of distinct elements | 6 |
Space group number | 2 |
Hermann-Mauguin space group symbol | P -1 |
Hall space group symbol | -P 1 |
Residual factor for all reflections | 0.0496 |
Residual factor for significantly intense reflections | 0.035 |
Weighted residual factors for significantly intense reflections | 0.0921 |
Weighted residual factors for all reflections included in the refinement | 0.0951 |
Goodness-of-fit parameter for all reflections included in the refinement | 1.068 |
Diffraction radiation wavelength | 0.71073 Å |
Diffraction radiation type | MoKα |