Information card for entry 7221851
Formula | C68 H70 Cl1.5 Cu2 N8.5 O11 |
Calculated formula | C68 H70 Cl1.5 Cu2 N8.5 O11 |
Title of publication | Supramolecular features in the engineering of 3d metal complexes with phenyl-substituted imidazoles as ligands: the case of copper(ii) |
Authors of publication | Kounavi, Konstantina A.; Kitos, Alexandros A.; Moushi, Eleni E.; Manos, Manolis J.; Papatriantafyllopoulou, Constantina; Tasiopoulos, Anastasios J.; Perlepes, Spyros P.; Nastopoulos, Vassilios |
Journal of publication | CrystEngComm |
Year of publication | 2015 |
Journal volume | 17 |
Journal issue | 39 |
Pages of publication | 7510 |
a | 11.0254 ± 0.0004 Å |
b | 22.5624 ± 0.0006 Å |
c | 14.028 ± 0.0005 Å |
α | 90° |
β | 93.327 ± 0.003° |
γ | 90° |
Cell volume | 3483.7 ± 0.2 Å3 |
Cell temperature | 100 ± 2 K |
Ambient diffraction temperature | 100 ± 2 K |
Number of distinct elements | 6 |
Space group number | 14 |
Hermann-Mauguin space group symbol | P 1 21/n 1 |
Hall space group symbol | -P 2yn |
Residual factor for all reflections | 0.0737 |
Residual factor for significantly intense reflections | 0.0584 |
Weighted residual factors for significantly intense reflections | 0.1772 |
Weighted residual factors for all reflections included in the refinement | 0.1846 |
Goodness-of-fit parameter for all reflections included in the refinement | 1.076 |
Diffraction radiation wavelength | 0.71073 Å |
Diffraction radiation type | MoKα |