Information card for entry 7221859
Formula | C7 H11 N Ni O9 |
Calculated formula | C7 H11 N Ni O9 |
Title of publication | Importance of polarization assisted/resonance assisted hydrogen bonding interactions and unconventional interactions in crystal formations of five new complexes bearing chelidamic acid through proton transfer mechanism |
Authors of publication | Mirzaei, Masoud; Eshtiagh-Hosseini, Hossein; shamsipur, mojtaba; Saeedi, Mahdi; Ardalani, Mehdi; Bauza, Antonio; Mague, Joel T.; Frontera, Antonio; Habibi, Morteza |
Journal of publication | RSC Adv. |
Year of publication | 2015 |
a | 14.7013 ± 0.0006 Å |
b | 6.8433 ± 0.0003 Å |
c | 22.2874 ± 0.001 Å |
α | 90° |
β | 90.163 ± 0.001° |
γ | 90° |
Cell volume | 2242.22 ± 0.17 Å3 |
Cell temperature | 150 ± 2 K |
Ambient diffraction temperature | 150 ± 2 K |
Number of distinct elements | 5 |
Space group number | 15 |
Hermann-Mauguin space group symbol | C 1 2/c 1 |
Hall space group symbol | -C 2yc |
Residual factor for all reflections | 0.0469 |
Residual factor for significantly intense reflections | 0.0444 |
Weighted residual factors for significantly intense reflections | 0.1172 |
Weighted residual factors for all reflections included in the refinement | 0.1189 |
Goodness-of-fit parameter for all reflections included in the refinement | 1.169 |
Diffraction radiation wavelength | 0.71073 Å |
Diffraction radiation type | MoKα |