Information card for entry 7221872
Common name | C5CL5N_150K |
Chemical name | Pentachloropyridine |
Formula | C5 Cl5 N |
Calculated formula | C5 Cl5 N |
SMILES | Clc1c(Cl)c(Cl)c(Cl)c(Cl)n1 |
Title of publication | Anisotropic displacement parameters from dispersion-corrected DFT methods and their experimental validation by temperature-dependent X-ray diffraction |
Authors of publication | George, Janine; Wang, Ai; Deringer, Volker L.; Wang, Ruimin; Dronskowski, Richard; Englert, Ulli |
Journal of publication | CrystEngComm |
Year of publication | 2015 |
Journal volume | 17 |
Journal issue | 38 |
Pages of publication | 7414 |
a | 5.3191 ± 0.0016 Å |
b | 5.1827 ± 0.0016 Å |
c | 14.894 ± 0.005 Å |
α | 90° |
β | 99.704 ± 0.005° |
γ | 90° |
Cell volume | 404.7 ± 0.2 Å3 |
Cell temperature | 150 ± 2 K |
Ambient diffraction temperature | 150 ± 2 K |
Number of distinct elements | 3 |
Space group number | 7 |
Hermann-Mauguin space group symbol | P 1 c 1 |
Hall space group symbol | P -2yc |
Residual factor for all reflections | 0.0427 |
Residual factor for significantly intense reflections | 0.0388 |
Weighted residual factors for significantly intense reflections | 0.0918 |
Weighted residual factors for all reflections included in the refinement | 0.0945 |
Goodness-of-fit parameter for all reflections included in the refinement | 1.062 |
Diffraction radiation wavelength | 0.71073 Å |
Diffraction radiation type | MoKα |