Information card for entry 7221875
Common name | C5CL5N_300K |
Chemical name | Pentachloropyridine |
Formula | C5 Cl5 N |
Calculated formula | C5 Cl5 N |
SMILES | Clc1c(Cl)c(Cl)c(Cl)c(Cl)n1 |
Title of publication | Anisotropic displacement parameters from dispersion-corrected DFT methods and their experimental validation by temperature-dependent X-ray diffraction |
Authors of publication | George, Janine; Wang, Ai; Deringer, Volker L.; Wang, Ruimin; Dronskowski, Richard; Englert, Ulli |
Journal of publication | CrystEngComm |
Year of publication | 2015 |
Journal volume | 17 |
Journal issue | 38 |
Pages of publication | 7414 |
a | 5.359 ± 0.004 Å |
b | 5.224 ± 0.004 Å |
c | 15.101 ± 0.013 Å |
α | 90° |
β | 100.228 ± 0.018° |
γ | 90° |
Cell volume | 416 ± 0.6 Å3 |
Cell temperature | 300 ± 2 K |
Ambient diffraction temperature | 300 ± 2 K |
Number of distinct elements | 3 |
Space group number | 7 |
Hermann-Mauguin space group symbol | P 1 c 1 |
Hall space group symbol | P -2yc |
Residual factor for all reflections | 0.1006 |
Residual factor for significantly intense reflections | 0.0525 |
Weighted residual factors for significantly intense reflections | 0.1126 |
Weighted residual factors for all reflections included in the refinement | 0.1344 |
Goodness-of-fit parameter for all reflections included in the refinement | 0.959 |
Diffraction radiation wavelength | 0.71073 Å |
Diffraction radiation type | MoKα |