Information card for entry 7221891
Formula | C20 H17 N O S |
Calculated formula | C20 H17 N O S |
SMILES | S1c2c(N(C(c3ccc4c(c3)cccc4)C1)C(=O)C)cccc2 |
Title of publication | Silver Mediated Thio-Acetoxylation and TFA Triggered Cyclization of Amino Disulfides with Unactivated Alkenes: Synthesis of 3-Aryl/Alkyl-1,4-benzothiazines |
Authors of publication | Prasad, Chelluri Durga Durga; Verma, Ajay; Sattar, Moh; Kumar, Sangit |
Journal of publication | RSC Adv. |
Year of publication | 2015 |
a | 16.3601 ± 0.0008 Å |
b | 6.1956 ± 0.0003 Å |
c | 16.4686 ± 0.0008 Å |
α | 90° |
β | 108.141 ± 0.002° |
γ | 90° |
Cell volume | 1586.29 ± 0.13 Å3 |
Cell temperature | 296 ± 2 K |
Ambient diffraction temperature | 296 ± 2 K |
Number of distinct elements | 5 |
Space group number | 14 |
Hermann-Mauguin space group symbol | P 1 21/c 1 |
Hall space group symbol | -P 2ybc |
Residual factor for all reflections | 0.0419 |
Residual factor for significantly intense reflections | 0.0352 |
Weighted residual factors for significantly intense reflections | 0.0921 |
Weighted residual factors for all reflections included in the refinement | 0.0972 |
Goodness-of-fit parameter for all reflections included in the refinement | 1.038 |
Diffraction radiation probe | x-ray |
Diffraction radiation wavelength | 0.71073 Å |
Diffraction radiation type | MoKα |