Information card for entry 7221914
Chemical name | Paracetamol pyridine solvate |
Formula | C21 H23 N3 O4 |
Calculated formula | C21 H23 N3 O4 |
SMILES | Oc1ccc(NC(=O)C)cc1.c1(NC(=O)C)ccc(O)cc1.n1ccccc1 |
Title of publication | Bis(paracetamol) pyridine ‒ a new elusive paracetamol solvate: from modeling the phase diagram to successful single-crystal growth and structure‒property relations |
Authors of publication | Zakharov, Boris A.; Ogienko, Andrey G.; Yunoshev, Alexander S.; Ancharov, Alexey I.; Boldyreva, Elena V. |
Journal of publication | CrystEngComm |
Year of publication | 2015 |
Journal volume | 17 |
Journal issue | 39 |
Pages of publication | 7543 |
a | 15.5225 ± 0.0014 Å |
b | 8.2788 ± 0.0005 Å |
c | 17.997 ± 0.002 Å |
α | 90° |
β | 121.964 ± 0.007° |
γ | 90° |
Cell volume | 1962.1 ± 0.3 Å3 |
Cell temperature | 150 ± 2 K |
Ambient diffraction temperature | 150 ± 2 K |
Number of distinct elements | 4 |
Space group number | 14 |
Hermann-Mauguin space group symbol | P 1 21/c 1 |
Hall space group symbol | -P 2ybc |
Residual factor for all reflections | 0.0786 |
Residual factor for significantly intense reflections | 0.0405 |
Weighted residual factors for significantly intense reflections | 0.0814 |
Weighted residual factors for all reflections included in the refinement | 0.0924 |
Goodness-of-fit parameter for all reflections included in the refinement | 0.935 |
Diffraction radiation wavelength | 0.71073 Å |
Diffraction radiation type | MoKα |