Information card for entry 7221949
Formula | C20 H23 N3 O3 S |
Calculated formula | C20 H23 N3 O3 S |
SMILES | S=C(NNC(=O)COc1cc(ccc1C)C(C)C)NC(=O)c1ccccc1 |
Title of publication | Partial rotation of the isopropyl group in the solid state: single-crystal-to-single-crystal phase transformation in a carvacrol derivative |
Authors of publication | Pete, Umesh D.; Dikundwar, Amol G.; Sharma, Vaishali M.; Gejji, Shridhar P.; Bendre, Ratnamala S.; Guru Row, Tayur N. |
Journal of publication | CrystEngComm |
Year of publication | 2015 |
Journal volume | 17 |
Journal issue | 39 |
Pages of publication | 7482 |
a | 33.842 ± 0.003 Å |
b | 8.1803 ± 0.0009 Å |
c | 15.5183 ± 0.0015 Å |
α | 90° |
β | 111.285 ± 0.011° |
γ | 90° |
Cell volume | 4003 ± 0.7 Å3 |
Cell temperature | 293 ± 2 K |
Ambient diffraction temperature | 293 ± 2 K |
Number of distinct elements | 5 |
Space group number | 15 |
Hermann-Mauguin space group symbol | C 1 2/c 1 |
Hall space group symbol | -C 2yc |
Residual factor for all reflections | 0.1157 |
Residual factor for significantly intense reflections | 0.0704 |
Weighted residual factors for significantly intense reflections | 0.1893 |
Weighted residual factors for all reflections included in the refinement | 0.2301 |
Goodness-of-fit parameter for all reflections included in the refinement | 1.025 |
Diffraction radiation wavelength | 0.71073 Å |
Diffraction radiation type | MoKα |