Information card for entry 7221957
Formula | C34 H32 B F4 Fe2 N O |
Calculated formula | C34 H32 B F4 Fe2 N O |
Title of publication | Structures of the conformational isomers and polymorph modifications of N-substituted 2,6-(E,E)-bis(ferrocenylidene)piperid-4-ones: photo- and electrochemically induced E/Z isomerization |
Authors of publication | Romanov, Alexander S.; Shapovalov, Alexey V.; Angles, Gary F.; Timofeeva, Tatiana V.; Corsini, Maddalena; Fusi, Stefania; Fabrizi de Biani, Fabrizia |
Journal of publication | CrystEngComm |
Year of publication | 2015 |
Journal volume | 17 |
Journal issue | 39 |
Pages of publication | 7564 |
a | 29.902 ± 0.004 Å |
b | 7.6059 ± 0.0011 Å |
c | 28.606 ± 0.005 Å |
α | 90° |
β | 110.776 ± 0.003° |
γ | 90° |
Cell volume | 6082.9 ± 1.6 Å3 |
Cell temperature | 100 ± 2 K |
Ambient diffraction temperature | 100 ± 2 K |
Number of distinct elements | 7 |
Space group number | 15 |
Hermann-Mauguin space group symbol | C 1 2/c 1 |
Hall space group symbol | -C 2yc |
Residual factor for all reflections | 0.0923 |
Residual factor for significantly intense reflections | 0.0663 |
Weighted residual factors for significantly intense reflections | 0.162 |
Weighted residual factors for all reflections included in the refinement | 0.1765 |
Goodness-of-fit parameter for all reflections included in the refinement | 1.099 |
Diffraction radiation wavelength | 0.71073 Å |
Diffraction radiation type | MoKα |